{"text_format":"3","workbook":"xlsx","n_sheets":2,"sheets":["Inversiones","base"],"not_rendered":{"charts":1,"images":1,"defined_names":2},"read":"whole","date_system":"1900"}

{"sheet":"Inversiones","index":0,"n_rows":65,"n_cols":37,"rows_kept":65}
[]
[]
[{"$nulls":3},"Reporte de Inversiones - Compañías de Seguros de Vida"]
[{"$nulls":3},"Datos a Diciembre de 2023"]
[{"$nulls":7},"Cifras en M$",1]
[null,null,"Seleccionar Moneda",{"$nulls":3},{"$f":"Moneda","v":"Cifras en UF"},"Cifras en UF",{"$f":"1000/J6","v":{"v":0.027181772121069786,"d":"0.0271818"}},36789.36]
[null,null,"Cifras en UF",{"$nulls":3},{"$f":"VLOOKUP(G6,H5:I7,2,0)","v":0.027181772121069786},"Cifras en US$",{"$f":"1000/J7","v":1.130467222102895},884.59]
[null,null,"copiar aquí para comparar","4LIFE","ALEMANA","BCI","BICE","BNP","BUPA VIDA","CAMARA","CF","CHUBB VIDA","CLC","CN LIFE","COLMENA","CONFUTURO","CONSORCIO NACIONAL","DIVINAPASTORA","EUROAMERICA","HELP SEGUROS","MAPFRE","METLIFE","MUT DE CARABINEROS","MUT. EJERC. Y AVIAC.","MUTUAL DE SEGUROS","OHIO","PENTA","PRINCIPAL","RENTA NACIONAL","SAVE BCJ","SECURITY PREVISION","SURA","SURAMERICANA V","ZURICH CHILE V","ZURICH SANTANDER"]
[null,null,"No modificar fila","4 Life Seguros","Alemana Seguros","BCI Seguros Vida","BICE Vida","BNP Paribas Cardif","Bupa","Cámara","CF Seguros de Vida","Chubb Vida","CLC","CN Life","Colmena Seguros","Confuturo","Consorcio Nacional","Divina Pastora","EuroAmérica","Help Seguros","MAPFRE vida","METLIFE","MUT DE CARABINEROS","MUT. EJERC. Y AVIAC.","MUTUAL DE SEGUROS","OHIO national","PENTA vida","PRINCIPAL","RENTA NACIONAL","SAVE SEGUROS","SECURITY PREVISION","SURA","SURAMERICANA","ZURICH CHILE","ZURICH SANTANDER","TOTAL CIAS. DE SEGUROS DE VIDA"]
[null,null,"TIPO DE INSTRUMENTO",{"$f":"PROPER(D9)","v":"4 Life Seguros"},{"$f":"PROPER(E9)","v":"Alemana Seguros"},{"$f":"F9","v":"BCI Seguros Vida"},{"$f":"G9","v":"BICE Vida"},{"$f":"H9","v":"BNP Paribas Cardif"},{"$f":"PROPER(I9)","v":"Bupa"},{"$f":"PROPER(J9)","v":"Cámara"},{"$f":"K9","v":"CF Seguros de Vida"},{"$f":"PROPER(L9)","v":"Chubb Vida"},"CLC","CN Life",{"$f":"PROPER(O9)","v":"Colmena Seguros"},"Confuturo","Consorcio Nacional","Divina Pastora","Euroamérica","Help Seguros","Mapfre Vida","Metlife","Mut de Carabineros","Mut. Ejerc. Y Aviac.","Mutual de Seguros","Ohio National","Penta Vida","Principal","Renta Nacional","Save Seguros","Security Prevision","Sura","Suramericana",{"$f":"PROPER(AH9)","v":"Zurich Chile"},{"$f":"PROPER(AI9)","v":"Zurich Santander"},{"$f":"PROPER(AJ9)","v":"Total Cias. De Seguros De Vida"}]
[3,"InstrumentosdelEstado","Instrumentos del Estado",{"$f":"VLOOKUP(D$10,base!$A$8:$S$45,$A11,FALSE)","v":23934177},{"$f":"VLOOKUP(E$10,base!$A$8:$S$45,$A11,FALSE)","v":3481234},{"$f":"VLOOKUP(F$10,base!$A$8:$S$45,$A11,FALSE)","v":1868609},{"$f":"VLOOKUP(G$10,base!$A$8:$S$45,$A11,FALSE)","v":18584926},{"$f":"VLOOKUP(H$10,base!$A$8:$S$45,$A11,FALSE)","v":109893646},{"$f":"VLOOKUP(I$10,base!$A$8:$S$45,$A11,FALSE)","v":6132301},{"$f":"VLOOKUP(J$10,base!$A$8:$S$45,$A11,FALSE)","v":1980367},{"$f":"VLOOKUP(K$10,base!$A$8:$S$45,$A11,FALSE)","v":20027097},{"$f":"VLOOKUP(L$10,base!$A$8:$S$45,$A11,FALSE)","v":89402227},{"$f":"VLOOKUP(M$10,base!$A$8:$S$45,$A11,FALSE)","v":2314180},{"$f":"VLOOKUP(N$10,base!$A$8:$S$45,$A11,FALSE)","v":1306577},{"$f":"VLOOKUP(O$10,base!$A$8:$S$45,$A11,FALSE)","v":4468977},{"$f":"VLOOKUP(P$10,base!$A$8:$S$45,$A11,FALSE)","v":67860131},{"$f":"VLOOKUP(Q$10,base!$A$8:$S$45,$A11,FALSE)","v":219300839},{"$f":"VLOOKUP(R$10,base!$A$8:$S$45,$A11,FALSE)","v":1463516},{"$f":"VLOOKUP(S$10,base!$A$8:$S$45,$A11,FALSE)","v":132040227},{"$f":"VLOOKUP(T$10,base!$A$8:$S$45,$A11,FALSE)","v":3059177},{"$f":"VLOOKUP(U$10,base!$A$8:$S$45,$A11,FALSE)","v":1003463},{"$f":"VLOOKUP(V$10,base!$A$8:$S$45,$A11,FALSE)","v":485673858},{"$f":"VLOOKUP(W$10,base!$A$8:$S$45,$A11,FALSE)","v":4815982},{"$f":"VLOOKUP(X$10,base!$A$8:$S$45,$A11,FALSE)","v":2878965},{"$f":"VLOOKUP(Y$10,base!$A$8:$S$45,$A11,FALSE)","v":10559909},{"$f":"VLOOKUP(Z$10,base!$A$8:$S$45,$A11,FALSE)","v":8836},{"$f":"VLOOKUP(AA$10,base!$A$8:$S$45,$A11,FALSE)","v":209682433},{"$f":"VLOOKUP(AB$10,base!$A$8:$S$45,$A11,FALSE)","v":48539318},{"$f":"VLOOKUP(AC$10,base!$A$8:$S$45,$A11,FALSE)","v":8708320},{"$f":"VLOOKUP(AD$10,base!$A$8:$S$45,$A11,FALSE)","v":2288466},{"$f":"VLOOKUP(AE$10,base!$A$8:$S$45,$A11,FALSE)","v":56434086},{"$f":"VLOOKUP(AF$10,base!$A$8:$S$45,$A11,FALSE)","v":51293624},{"$f":"VLOOKUP(AG$10,base!$A$8:$S$45,$A11,FALSE)","v":6350518},{"$f":"VLOOKUP(AH$10,base!$A$8:$S$45,$A11,FALSE)","v":132237349},{"$f":"VLOOKUP(AI$10,base!$A$8:$S$45,$A11,FALSE)","v":10478158},{"$f":"VLOOKUP(AJ$10,base!$A$8:$S$45,$A11,FALSE)","v":0}]
[4,"DepÃ³sitosaplazo","Depósitos a Plazo",{"$f":"VLOOKUP(D$10,base!$A$8:$S$45,$A12,FALSE)","v":1317458},{"$f":"VLOOKUP(E$10,base!$A$8:$S$45,$A12,FALSE)","v":0},{"$f":"VLOOKUP(F$10,base!$A$8:$S$45,$A12,FALSE)","v":3972680},{"$f":"VLOOKUP(G$10,base!$A$8:$S$45,$A12,FALSE)","v":62792478},{"$f":"VLOOKUP(H$10,base!$A$8:$S$45,$A12,FALSE)","v":3109061},{"$f":"VLOOKUP(I$10,base!$A$8:$S$45,$A12,FALSE)","v":1545200},{"$f":"VLOOKUP(J$10,base!$A$8:$S$45,$A12,FALSE)","v":0},{"$f":"VLOOKUP(K$10,base!$A$8:$S$45,$A12,FALSE)","v":0},{"$f":"VLOOKUP(L$10,base!$A$8:$S$45,$A12,FALSE)","v":0},{"$f":"VLOOKUP(M$10,base!$A$8:$S$45,$A12,FALSE)","v":2890},{"$f":"VLOOKUP(N$10,base!$A$8:$S$45,$A12,FALSE)","v":1140256},{"$f":"VLOOKUP(O$10,base!$A$8:$S$45,$A12,FALSE)","v":1419},{"$f":"VLOOKUP(P$10,base!$A$8:$S$45,$A12,FALSE)","v":618530028},{"$f":"VLOOKUP(Q$10,base!$A$8:$S$45,$A12,FALSE)","v":56747890},{"$f":"VLOOKUP(R$10,base!$A$8:$S$45,$A12,FALSE)","v":441540},{"$f":"VLOOKUP(S$10,base!$A$8:$S$45,$A12,FALSE)","v":26854914},{"$f":"VLOOKUP(T$10,base!$A$8:$S$45,$A12,FALSE)","v":101534},{"$f":"VLOOKUP(U$10,base!$A$8:$S$45,$A12,FALSE)","v":0},{"$f":"VLOOKUP(V$10,base!$A$8:$S$45,$A12,FALSE)","v":0},{"$f":"VLOOKUP(W$10,base!$A$8:$S$45,$A12,FALSE)","v":139558884},{"$f":"VLOOKUP(X$10,base!$A$8:$S$45,$A12,FALSE)","v":9537591},{"$f":"VLOOKUP(Y$10,base!$A$8:$S$45,$A12,FALSE)","v":0},{"$f":"VLOOKUP(Z$10,base!$A$8:$S$45,$A12,FALSE)","v":31972885},{"$f":"VLOOKUP(AA$10,base!$A$8:$S$45,$A12,FALSE)","v":123948994},{"$f":"VLOOKUP(AB$10,base!$A$8:$S$45,$A12,FALSE)","v":48932446},{"$f":"VLOOKUP(AC$10,base!$A$8:$S$45,$A12,FALSE)","v":17322647},{"$f":"VLOOKUP(AD$10,base!$A$8:$S$45,$A12,FALSE)","v":4714603},{"$f":"VLOOKUP(AE$10,base!$A$8:$S$45,$A12,FALSE)","v":6979508},{"$f":"VLOOKUP(AF$10,base!$A$8:$S$45,$A12,FALSE)","v":3651050},{"$f":"VLOOKUP(AG$10,base!$A$8:$S$45,$A12,FALSE)","v":0},{"$f":"VLOOKUP(AH$10,base!$A$8:$S$45,$A12,FALSE)","v":55484573},{"$f":"VLOOKUP(AI$10,base!$A$8:$S$45,$A12,FALSE)","v":6513371},{"$f":"VLOOKUP(AJ$10,base!$A$8:$S$45,$A12,FALSE)","v":0}]
[5,"Bonosbancarios","Bonos Bancarios",{"$f":"VLOOKUP(D$10,base!$A$8:$S$45,$A13,FALSE)","v":78791123},{"$f":"VLOOKUP(E$10,base!$A$8:$S$45,$A13,FALSE)","v":4579709},{"$f":"VLOOKUP(F$10,base!$A$8:$S$45,$A13,FALSE)","v":84593368},{"$f":"VLOOKUP(G$10,base!$A$8:$S$45,$A13,FALSE)","v":648811181},{"$f":"VLOOKUP(H$10,base!$A$8:$S$45,$A13,FALSE)","v":99042291},{"$f":"VLOOKUP(I$10,base!$A$8:$S$45,$A13,FALSE)","v":4019389},{"$f":"VLOOKUP(J$10,base!$A$8:$S$45,$A13,FALSE)","v":28167755},{"$f":"VLOOKUP(K$10,base!$A$8:$S$45,$A13,FALSE)","v":11549673},{"$f":"VLOOKUP(L$10,base!$A$8:$S$45,$A13,FALSE)","v":63482412},{"$f":"VLOOKUP(M$10,base!$A$8:$S$45,$A13,FALSE)","v":7110419},{"$f":"VLOOKUP(N$10,base!$A$8:$S$45,$A13,FALSE)","v":40406943},{"$f":"VLOOKUP(O$10,base!$A$8:$S$45,$A13,FALSE)","v":6611713},{"$f":"VLOOKUP(P$10,base!$A$8:$S$45,$A13,FALSE)","v":1120330039},{"$f":"VLOOKUP(Q$10,base!$A$8:$S$45,$A13,FALSE)","v":500978340},{"$f":"VLOOKUP(R$10,base!$A$8:$S$45,$A13,FALSE)","v":884699},{"$f":"VLOOKUP(S$10,base!$A$8:$S$45,$A13,FALSE)","v":7213540},{"$f":"VLOOKUP(T$10,base!$A$8:$S$45,$A13,FALSE)","v":7496463},{"$f":"VLOOKUP(U$10,base!$A$8:$S$45,$A13,FALSE)","v":12000670},{"$f":"VLOOKUP(V$10,base!$A$8:$S$45,$A13,FALSE)","v":1074596825},{"$f":"VLOOKUP(W$10,base!$A$8:$S$45,$A13,FALSE)","v":4640946},{"$f":"VLOOKUP(X$10,base!$A$8:$S$45,$A13,FALSE)","v":42795586},{"$f":"VLOOKUP(Y$10,base!$A$8:$S$45,$A13,FALSE)","v":51767849},{"$f":"VLOOKUP(Z$10,base!$A$8:$S$45,$A13,FALSE)","v":231814923},{"$f":"VLOOKUP(AA$10,base!$A$8:$S$45,$A13,FALSE)","v":504202104},{"$f":"VLOOKUP(AB$10,base!$A$8:$S$45,$A13,FALSE)","v":631082773},{"$f":"VLOOKUP(AC$10,base!$A$8:$S$45,$A13,FALSE)","v":319167853},{"$f":"VLOOKUP(AD$10,base!$A$8:$S$45,$A13,FALSE)","v":0},{"$f":"VLOOKUP(AE$10,base!$A$8:$S$45,$A13,FALSE)","v":362685183},{"$f":"VLOOKUP(AF$10,base!$A$8:$S$45,$A13,FALSE)","v":102679244},{"$f":"VLOOKUP(AG$10,base!$A$8:$S$45,$A13,FALSE)","v":27069407},{"$f":"VLOOKUP(AH$10,base!$A$8:$S$45,$A13,FALSE)","v":242528362},{"$f":"VLOOKUP(AI$10,base!$A$8:$S$45,$A13,FALSE)","v":9815811},{"$f":"VLOOKUP(AJ$10,base!$A$8:$S$45,$A13,FALSE)","v":0}]
[6,"Letrashipotecarias","Letras Hipotecarias",{"$f":"VLOOKUP(D$10,base!$A$8:$S$45,$A14,FALSE)","v":540126},{"$f":"VLOOKUP(E$10,base!$A$8:$S$45,$A14,FALSE)","v":0},{"$f":"VLOOKUP(F$10,base!$A$8:$S$45,$A14,FALSE)","v":46862},{"$f":"VLOOKUP(G$10,base!$A$8:$S$45,$A14,FALSE)","v":3631726},{"$f":"VLOOKUP(H$10,base!$A$8:$S$45,$A14,FALSE)","v":2598},{"$f":"VLOOKUP(I$10,base!$A$8:$S$45,$A14,FALSE)","v":0},{"$f":"VLOOKUP(J$10,base!$A$8:$S$45,$A14,FALSE)","v":0},{"$f":"VLOOKUP(K$10,base!$A$8:$S$45,$A14,FALSE)","v":0},{"$f":"VLOOKUP(L$10,base!$A$8:$S$45,$A14,FALSE)","v":0},{"$f":"VLOOKUP(M$10,base!$A$8:$S$45,$A14,FALSE)","v":27084},{"$f":"VLOOKUP(N$10,base!$A$8:$S$45,$A14,FALSE)","v":157999},{"$f":"VLOOKUP(O$10,base!$A$8:$S$45,$A14,FALSE)","v":21869},{"$f":"VLOOKUP(P$10,base!$A$8:$S$45,$A14,FALSE)","v":34675580},{"$f":"VLOOKUP(Q$10,base!$A$8:$S$45,$A14,FALSE)","v":7542736},{"$f":"VLOOKUP(R$10,base!$A$8:$S$45,$A14,FALSE)","v":0},{"$f":"VLOOKUP(S$10,base!$A$8:$S$45,$A14,FALSE)","v":429239},{"$f":"VLOOKUP(T$10,base!$A$8:$S$45,$A14,FALSE)","v":0},{"$f":"VLOOKUP(U$10,base!$A$8:$S$45,$A14,FALSE)","v":1745347},{"$f":"VLOOKUP(V$10,base!$A$8:$S$45,$A14,FALSE)","v":8159380},{"$f":"VLOOKUP(W$10,base!$A$8:$S$45,$A14,FALSE)","v":0},{"$f":"VLOOKUP(X$10,base!$A$8:$S$45,$A14,FALSE)","v":585832},{"$f":"VLOOKUP(Y$10,base!$A$8:$S$45,$A14,FALSE)","v":6875},{"$f":"VLOOKUP(Z$10,base!$A$8:$S$45,$A14,FALSE)","v":25041411},{"$f":"VLOOKUP(AA$10,base!$A$8:$S$45,$A14,FALSE)","v":23826142},{"$f":"VLOOKUP(AB$10,base!$A$8:$S$45,$A14,FALSE)","v":34044670},{"$f":"VLOOKUP(AC$10,base!$A$8:$S$45,$A14,FALSE)","v":10986930},{"$f":"VLOOKUP(AD$10,base!$A$8:$S$45,$A14,FALSE)","v":0},{"$f":"VLOOKUP(AE$10,base!$A$8:$S$45,$A14,FALSE)","v":23720227},{"$f":"VLOOKUP(AF$10,base!$A$8:$S$45,$A14,FALSE)","v":209684},{"$f":"VLOOKUP(AG$10,base!$A$8:$S$45,$A14,FALSE)","v":0},{"$f":"VLOOKUP(AH$10,base!$A$8:$S$45,$A14,FALSE)","v":25674},{"$f":"VLOOKUP(AI$10,base!$A$8:$S$45,$A14,FALSE)","v":4091997},{"$f":"VLOOKUP(AJ$10,base!$A$8:$S$45,$A14,FALSE)","v":0}]
[7,"Bonosydebentures","Bonos y Debentures",{"$f":"VLOOKUP(D$10,base!$A$8:$S$45,$A15,FALSE)","v":308129458},{"$f":"VLOOKUP(E$10,base!$A$8:$S$45,$A15,FALSE)","v":3037039},{"$f":"VLOOKUP(F$10,base!$A$8:$S$45,$A15,FALSE)","v":73753205},{"$f":"VLOOKUP(G$10,base!$A$8:$S$45,$A15,FALSE)","v":2253487379},{"$f":"VLOOKUP(H$10,base!$A$8:$S$45,$A15,FALSE)","v":64754765},{"$f":"VLOOKUP(I$10,base!$A$8:$S$45,$A15,FALSE)","v":0},{"$f":"VLOOKUP(J$10,base!$A$8:$S$45,$A15,FALSE)","v":4324633},{"$f":"VLOOKUP(K$10,base!$A$8:$S$45,$A15,FALSE)","v":0},{"$f":"VLOOKUP(L$10,base!$A$8:$S$45,$A15,FALSE)","v":54528090},{"$f":"VLOOKUP(M$10,base!$A$8:$S$45,$A15,FALSE)","v":3270479},{"$f":"VLOOKUP(N$10,base!$A$8:$S$45,$A15,FALSE)","v":411456600},{"$f":"VLOOKUP(O$10,base!$A$8:$S$45,$A15,FALSE)","v":3772776},{"$f":"VLOOKUP(P$10,base!$A$8:$S$45,$A15,FALSE)","v":1776929610},{"$f":"VLOOKUP(Q$10,base!$A$8:$S$45,$A15,FALSE)","v":1945217452},{"$f":"VLOOKUP(R$10,base!$A$8:$S$45,$A15,FALSE)","v":0},{"$f":"VLOOKUP(S$10,base!$A$8:$S$45,$A15,FALSE)","v":696805268},{"$f":"VLOOKUP(T$10,base!$A$8:$S$45,$A15,FALSE)","v":4005429},{"$f":"VLOOKUP(U$10,base!$A$8:$S$45,$A15,FALSE)","v":27689145},{"$f":"VLOOKUP(V$10,base!$A$8:$S$45,$A15,FALSE)","v":2476369557},{"$f":"VLOOKUP(W$10,base!$A$8:$S$45,$A15,FALSE)","v":108975},{"$f":"VLOOKUP(X$10,base!$A$8:$S$45,$A15,FALSE)","v":34690766},{"$f":"VLOOKUP(Y$10,base!$A$8:$S$45,$A15,FALSE)","v":110470842},{"$f":"VLOOKUP(Z$10,base!$A$8:$S$45,$A15,FALSE)","v":377540964},{"$f":"VLOOKUP(AA$10,base!$A$8:$S$45,$A15,FALSE)","v":1707611041},{"$f":"VLOOKUP(AB$10,base!$A$8:$S$45,$A15,FALSE)","v":978027900},{"$f":"VLOOKUP(AC$10,base!$A$8:$S$45,$A15,FALSE)","v":501492934},{"$f":"VLOOKUP(AD$10,base!$A$8:$S$45,$A15,FALSE)","v":12355084},{"$f":"VLOOKUP(AE$10,base!$A$8:$S$45,$A15,FALSE)","v":989425683},{"$f":"VLOOKUP(AF$10,base!$A$8:$S$45,$A15,FALSE)","v":153617546},{"$f":"VLOOKUP(AG$10,base!$A$8:$S$45,$A15,FALSE)","v":6627964},{"$f":"VLOOKUP(AH$10,base!$A$8:$S$45,$A15,FALSE)","v":1302086576},{"$f":"VLOOKUP(AI$10,base!$A$8:$S$45,$A15,FALSE)","v":75943495},{"$f":"VLOOKUP(AJ$10,base!$A$8:$S$45,$A15,FALSE)","v":0}]
[8,"CrÃ©ditossindicados","Créditos Sindicados",{"$f":"VLOOKUP(D$10,base!$A$8:$S$45,$A16,FALSE)","v":1690963},{"$f":"VLOOKUP(E$10,base!$A$8:$S$45,$A16,FALSE)","v":0},{"$f":"VLOOKUP(F$10,base!$A$8:$S$45,$A16,FALSE)","v":0},{"$f":"VLOOKUP(G$10,base!$A$8:$S$45,$A16,FALSE)","v":86489841},{"$f":"VLOOKUP(H$10,base!$A$8:$S$45,$A16,FALSE)","v":0},{"$f":"VLOOKUP(I$10,base!$A$8:$S$45,$A16,FALSE)","v":0},{"$f":"VLOOKUP(J$10,base!$A$8:$S$45,$A16,FALSE)","v":0},{"$f":"VLOOKUP(K$10,base!$A$8:$S$45,$A16,FALSE)","v":0},{"$f":"VLOOKUP(L$10,base!$A$8:$S$45,$A16,FALSE)","v":0},{"$f":"VLOOKUP(M$10,base!$A$8:$S$45,$A16,FALSE)","v":0},{"$f":"VLOOKUP(N$10,base!$A$8:$S$45,$A16,FALSE)","v":25028364},{"$f":"VLOOKUP(O$10,base!$A$8:$S$45,$A16,FALSE)","v":0},{"$f":"VLOOKUP(P$10,base!$A$8:$S$45,$A16,FALSE)","v":200605363},{"$f":"VLOOKUP(Q$10,base!$A$8:$S$45,$A16,FALSE)","v":231514045},{"$f":"VLOOKUP(R$10,base!$A$8:$S$45,$A16,FALSE)","v":0},{"$f":"VLOOKUP(S$10,base!$A$8:$S$45,$A16,FALSE)","v":35309159},{"$f":"VLOOKUP(T$10,base!$A$8:$S$45,$A16,FALSE)","v":0},{"$f":"VLOOKUP(U$10,base!$A$8:$S$45,$A16,FALSE)","v":0},{"$f":"VLOOKUP(V$10,base!$A$8:$S$45,$A16,FALSE)","v":262754598},{"$f":"VLOOKUP(W$10,base!$A$8:$S$45,$A16,FALSE)","v":0},{"$f":"VLOOKUP(X$10,base!$A$8:$S$45,$A16,FALSE)","v":0},{"$f":"VLOOKUP(Y$10,base!$A$8:$S$45,$A16,FALSE)","v":0},{"$f":"VLOOKUP(Z$10,base!$A$8:$S$45,$A16,FALSE)","v":0},{"$f":"VLOOKUP(AA$10,base!$A$8:$S$45,$A16,FALSE)","v":194715578},{"$f":"VLOOKUP(AB$10,base!$A$8:$S$45,$A16,FALSE)","v":104373003},{"$f":"VLOOKUP(AC$10,base!$A$8:$S$45,$A16,FALSE)","v":0},{"$f":"VLOOKUP(AD$10,base!$A$8:$S$45,$A16,FALSE)","v":0},{"$f":"VLOOKUP(AE$10,base!$A$8:$S$45,$A16,FALSE)","v":56554536},{"$f":"VLOOKUP(AF$10,base!$A$8:$S$45,$A16,FALSE)","v":0},{"$f":"VLOOKUP(AG$10,base!$A$8:$S$45,$A16,FALSE)","v":0},{"$f":"VLOOKUP(AH$10,base!$A$8:$S$45,$A16,FALSE)","v":13349887},{"$f":"VLOOKUP(AI$10,base!$A$8:$S$45,$A16,FALSE)","v":0},{"$f":"VLOOKUP(AJ$10,base!$A$8:$S$45,$A16,FALSE)","v":0}]
[9,"Mutuoshipotecarios","Mutuos Hipotecarios",{"$f":"VLOOKUP(D$10,base!$A$8:$S$45,$A17,FALSE)","v":71463861},{"$f":"VLOOKUP(E$10,base!$A$8:$S$45,$A17,FALSE)","v":0},{"$f":"VLOOKUP(F$10,base!$A$8:$S$45,$A17,FALSE)","v":3380269},{"$f":"VLOOKUP(G$10,base!$A$8:$S$45,$A17,FALSE)","v":960768095},{"$f":"VLOOKUP(H$10,base!$A$8:$S$45,$A17,FALSE)","v":132161},{"$f":"VLOOKUP(I$10,base!$A$8:$S$45,$A17,FALSE)","v":0},{"$f":"VLOOKUP(J$10,base!$A$8:$S$45,$A17,FALSE)","v":0},{"$f":"VLOOKUP(K$10,base!$A$8:$S$45,$A17,FALSE)","v":0},{"$f":"VLOOKUP(L$10,base!$A$8:$S$45,$A17,FALSE)","v":0},{"$f":"VLOOKUP(M$10,base!$A$8:$S$45,$A17,FALSE)","v":0},{"$f":"VLOOKUP(N$10,base!$A$8:$S$45,$A17,FALSE)","v":60457833},{"$f":"VLOOKUP(O$10,base!$A$8:$S$45,$A17,FALSE)","v":0},{"$f":"VLOOKUP(P$10,base!$A$8:$S$45,$A17,FALSE)","v":369876397},{"$f":"VLOOKUP(Q$10,base!$A$8:$S$45,$A17,FALSE)","v":819803718},{"$f":"VLOOKUP(R$10,base!$A$8:$S$45,$A17,FALSE)","v":0},{"$f":"VLOOKUP(S$10,base!$A$8:$S$45,$A17,FALSE)","v":30050651},{"$f":"VLOOKUP(T$10,base!$A$8:$S$45,$A17,FALSE)","v":0},{"$f":"VLOOKUP(U$10,base!$A$8:$S$45,$A17,FALSE)","v":0},{"$f":"VLOOKUP(V$10,base!$A$8:$S$45,$A17,FALSE)","v":1915326527},{"$f":"VLOOKUP(W$10,base!$A$8:$S$45,$A17,FALSE)","v":0},{"$f":"VLOOKUP(X$10,base!$A$8:$S$45,$A17,FALSE)","v":0},{"$f":"VLOOKUP(Y$10,base!$A$8:$S$45,$A17,FALSE)","v":51749832},{"$f":"VLOOKUP(Z$10,base!$A$8:$S$45,$A17,FALSE)","v":80224544},{"$f":"VLOOKUP(AA$10,base!$A$8:$S$45,$A17,FALSE)","v":697763745},{"$f":"VLOOKUP(AB$10,base!$A$8:$S$45,$A17,FALSE)","v":845416290},{"$f":"VLOOKUP(AC$10,base!$A$8:$S$45,$A17,FALSE)","v":88122345},{"$f":"VLOOKUP(AD$10,base!$A$8:$S$45,$A17,FALSE)","v":0},{"$f":"VLOOKUP(AE$10,base!$A$8:$S$45,$A17,FALSE)","v":425074412},{"$f":"VLOOKUP(AF$10,base!$A$8:$S$45,$A17,FALSE)","v":4193938},{"$f":"VLOOKUP(AG$10,base!$A$8:$S$45,$A17,FALSE)","v":0},{"$f":"VLOOKUP(AH$10,base!$A$8:$S$45,$A17,FALSE)","v":315732377},{"$f":"VLOOKUP(AI$10,base!$A$8:$S$45,$A17,FALSE)","v":17459435},{"$f":"VLOOKUP(AJ$10,base!$A$8:$S$45,$A17,FALSE)","v":0}]
[10,"AccionesdeS.A.","Acciones de S.A.",{"$f":"VLOOKUP(D$10,base!$A$8:$S$45,$A18,FALSE)","v":1753758},{"$f":"VLOOKUP(E$10,base!$A$8:$S$45,$A18,FALSE)","v":0},{"$f":"VLOOKUP(F$10,base!$A$8:$S$45,$A18,FALSE)","v":325023},{"$f":"VLOOKUP(G$10,base!$A$8:$S$45,$A18,FALSE)","v":2253278},{"$f":"VLOOKUP(H$10,base!$A$8:$S$45,$A18,FALSE)","v":0},{"$f":"VLOOKUP(I$10,base!$A$8:$S$45,$A18,FALSE)","v":0},{"$f":"VLOOKUP(J$10,base!$A$8:$S$45,$A18,FALSE)","v":0},{"$f":"VLOOKUP(K$10,base!$A$8:$S$45,$A18,FALSE)","v":0},{"$f":"VLOOKUP(L$10,base!$A$8:$S$45,$A18,FALSE)","v":0},{"$f":"VLOOKUP(M$10,base!$A$8:$S$45,$A18,FALSE)","v":0},{"$f":"VLOOKUP(N$10,base!$A$8:$S$45,$A18,FALSE)","v":8761664},{"$f":"VLOOKUP(O$10,base!$A$8:$S$45,$A18,FALSE)","v":0},{"$f":"VLOOKUP(P$10,base!$A$8:$S$45,$A18,FALSE)","v":39894749},{"$f":"VLOOKUP(Q$10,base!$A$8:$S$45,$A18,FALSE)","v":237460903},{"$f":"VLOOKUP(R$10,base!$A$8:$S$45,$A18,FALSE)","v":0},{"$f":"VLOOKUP(S$10,base!$A$8:$S$45,$A18,FALSE)","v":42781221},{"$f":"VLOOKUP(T$10,base!$A$8:$S$45,$A18,FALSE)","v":0},{"$f":"VLOOKUP(U$10,base!$A$8:$S$45,$A18,FALSE)","v":0},{"$f":"VLOOKUP(V$10,base!$A$8:$S$45,$A18,FALSE)","v":0},{"$f":"VLOOKUP(W$10,base!$A$8:$S$45,$A18,FALSE)","v":0},{"$f":"VLOOKUP(X$10,base!$A$8:$S$45,$A18,FALSE)","v":1304710},{"$f":"VLOOKUP(Y$10,base!$A$8:$S$45,$A18,FALSE)","v":1088503},{"$f":"VLOOKUP(Z$10,base!$A$8:$S$45,$A18,FALSE)","v":0},{"$f":"VLOOKUP(AA$10,base!$A$8:$S$45,$A18,FALSE)","v":43639873},{"$f":"VLOOKUP(AB$10,base!$A$8:$S$45,$A18,FALSE)","v":0},{"$f":"VLOOKUP(AC$10,base!$A$8:$S$45,$A18,FALSE)","v":134026},{"$f":"VLOOKUP(AD$10,base!$A$8:$S$45,$A18,FALSE)","v":0},{"$f":"VLOOKUP(AE$10,base!$A$8:$S$45,$A18,FALSE)","v":12384745},{"$f":"VLOOKUP(AF$10,base!$A$8:$S$45,$A18,FALSE)","v":0},{"$f":"VLOOKUP(AG$10,base!$A$8:$S$45,$A18,FALSE)","v":0},{"$f":"VLOOKUP(AH$10,base!$A$8:$S$45,$A18,FALSE)","v":0},{"$f":"VLOOKUP(AI$10,base!$A$8:$S$45,$A18,FALSE)","v":0},{"$f":"VLOOKUP(AJ$10,base!$A$8:$S$45,$A18,FALSE)","v":0}]
[11,"Fondosmutuos","Fondos Mutuos",{"$f":"VLOOKUP(D$10,base!$A$8:$S$45,$A19,FALSE)","v":3845595},{"$f":"VLOOKUP(E$10,base!$A$8:$S$45,$A19,FALSE)","v":212878},{"$f":"VLOOKUP(F$10,base!$A$8:$S$45,$A19,FALSE)","v":18603788},{"$f":"VLOOKUP(G$10,base!$A$8:$S$45,$A19,FALSE)","v":27938603},{"$f":"VLOOKUP(H$10,base!$A$8:$S$45,$A19,FALSE)","v":4059444},{"$f":"VLOOKUP(I$10,base!$A$8:$S$45,$A19,FALSE)","v":514373},{"$f":"VLOOKUP(J$10,base!$A$8:$S$45,$A19,FALSE)","v":3844554},{"$f":"VLOOKUP(K$10,base!$A$8:$S$45,$A19,FALSE)","v":10901},{"$f":"VLOOKUP(L$10,base!$A$8:$S$45,$A19,FALSE)","v":0},{"$f":"VLOOKUP(M$10,base!$A$8:$S$45,$A19,FALSE)","v":0},{"$f":"VLOOKUP(N$10,base!$A$8:$S$45,$A19,FALSE)","v":25719506},{"$f":"VLOOKUP(O$10,base!$A$8:$S$45,$A19,FALSE)","v":0},{"$f":"VLOOKUP(P$10,base!$A$8:$S$45,$A19,FALSE)","v":69760111},{"$f":"VLOOKUP(Q$10,base!$A$8:$S$45,$A19,FALSE)","v":752726042},{"$f":"VLOOKUP(R$10,base!$A$8:$S$45,$A19,FALSE)","v":0},{"$f":"VLOOKUP(S$10,base!$A$8:$S$45,$A19,FALSE)","v":33436301},{"$f":"VLOOKUP(T$10,base!$A$8:$S$45,$A19,FALSE)","v":0},{"$f":"VLOOKUP(U$10,base!$A$8:$S$45,$A19,FALSE)","v":150736},{"$f":"VLOOKUP(V$10,base!$A$8:$S$45,$A19,FALSE)","v":170602133},{"$f":"VLOOKUP(W$10,base!$A$8:$S$45,$A19,FALSE)","v":15526223},{"$f":"VLOOKUP(X$10,base!$A$8:$S$45,$A19,FALSE)","v":9620064},{"$f":"VLOOKUP(Y$10,base!$A$8:$S$45,$A19,FALSE)","v":4778651},{"$f":"VLOOKUP(Z$10,base!$A$8:$S$45,$A19,FALSE)","v":31327736},{"$f":"VLOOKUP(AA$10,base!$A$8:$S$45,$A19,FALSE)","v":7457738},{"$f":"VLOOKUP(AB$10,base!$A$8:$S$45,$A19,FALSE)","v":191238403},{"$f":"VLOOKUP(AC$10,base!$A$8:$S$45,$A19,FALSE)","v":14819938},{"$f":"VLOOKUP(AD$10,base!$A$8:$S$45,$A19,FALSE)","v":56715},{"$f":"VLOOKUP(AE$10,base!$A$8:$S$45,$A19,FALSE)","v":246693899},{"$f":"VLOOKUP(AF$10,base!$A$8:$S$45,$A19,FALSE)","v":455975835},{"$f":"VLOOKUP(AG$10,base!$A$8:$S$45,$A19,FALSE)","v":0},{"$f":"VLOOKUP(AH$10,base!$A$8:$S$45,$A19,FALSE)","v":289337602},{"$f":"VLOOKUP(AI$10,base!$A$8:$S$45,$A19,FALSE)","v":7480823},{"$f":"VLOOKUP(AJ$10,base!$A$8:$S$45,$A19,FALSE)","v":0}]
[12,"FondoinversiÃ³n","Fondos de Inversión",{"$f":"VLOOKUP(D$10,base!$A$8:$S$45,$A20,FALSE)","v":86577148},{"$f":"VLOOKUP(E$10,base!$A$8:$S$45,$A20,FALSE)","v":0},{"$f":"VLOOKUP(F$10,base!$A$8:$S$45,$A20,FALSE)","v":18057356},{"$f":"VLOOKUP(G$10,base!$A$8:$S$45,$A20,FALSE)","v":120907502},{"$f":"VLOOKUP(H$10,base!$A$8:$S$45,$A20,FALSE)","v":0},{"$f":"VLOOKUP(I$10,base!$A$8:$S$45,$A20,FALSE)","v":0},{"$f":"VLOOKUP(J$10,base!$A$8:$S$45,$A20,FALSE)","v":0},{"$f":"VLOOKUP(K$10,base!$A$8:$S$45,$A20,FALSE)","v":0},{"$f":"VLOOKUP(L$10,base!$A$8:$S$45,$A20,FALSE)","v":0},{"$f":"VLOOKUP(M$10,base!$A$8:$S$45,$A20,FALSE)","v":0},{"$f":"VLOOKUP(N$10,base!$A$8:$S$45,$A20,FALSE)","v":35342642},{"$f":"VLOOKUP(O$10,base!$A$8:$S$45,$A20,FALSE)","v":0},{"$f":"VLOOKUP(P$10,base!$A$8:$S$45,$A20,FALSE)","v":224443506},{"$f":"VLOOKUP(Q$10,base!$A$8:$S$45,$A20,FALSE)","v":271567824},{"$f":"VLOOKUP(R$10,base!$A$8:$S$45,$A20,FALSE)","v":0},{"$f":"VLOOKUP(S$10,base!$A$8:$S$45,$A20,FALSE)","v":79479379},{"$f":"VLOOKUP(T$10,base!$A$8:$S$45,$A20,FALSE)","v":0},{"$f":"VLOOKUP(U$10,base!$A$8:$S$45,$A20,FALSE)","v":1985427},{"$f":"VLOOKUP(V$10,base!$A$8:$S$45,$A20,FALSE)","v":184700614},{"$f":"VLOOKUP(W$10,base!$A$8:$S$45,$A20,FALSE)","v":0},{"$f":"VLOOKUP(X$10,base!$A$8:$S$45,$A20,FALSE)","v":1262820},{"$f":"VLOOKUP(Y$10,base!$A$8:$S$45,$A20,FALSE)","v":3939645},{"$f":"VLOOKUP(Z$10,base!$A$8:$S$45,$A20,FALSE)","v":7276297},{"$f":"VLOOKUP(AA$10,base!$A$8:$S$45,$A20,FALSE)","v":800796901},{"$f":"VLOOKUP(AB$10,base!$A$8:$S$45,$A20,FALSE)","v":156854263},{"$f":"VLOOKUP(AC$10,base!$A$8:$S$45,$A20,FALSE)","v":1093060},{"$f":"VLOOKUP(AD$10,base!$A$8:$S$45,$A20,FALSE)","v":2688978},{"$f":"VLOOKUP(AE$10,base!$A$8:$S$45,$A20,FALSE)","v":258864832},{"$f":"VLOOKUP(AF$10,base!$A$8:$S$45,$A20,FALSE)","v":23772753},{"$f":"VLOOKUP(AG$10,base!$A$8:$S$45,$A20,FALSE)","v":0},{"$f":"VLOOKUP(AH$10,base!$A$8:$S$45,$A20,FALSE)","v":26588603},{"$f":"VLOOKUP(AI$10,base!$A$8:$S$45,$A20,FALSE)","v":6120282},{"$f":"VLOOKUP(AJ$10,base!$A$8:$S$45,$A20,FALSE)","v":0}]
{"$rows_left_out":46}
{"sheet":"base","index":1,"n_rows":49,"n_cols":19,"rows_kept":49,"hidden":true}
["COMISIÓN PARA EL MERCADO FINANCIERO"]
["Tipo de compañía: CIAS. DE SEGUROS DE VIDA Y CIAS. REASEGURADORAS DE VIDA"]
[]
[]
[]
[null,null,"InstrumentosdelEstado","DepÃ³sitosaplazo","Bonosbancarios","Letrashipotecarias","Bonosydebentures","CrÃ©ditossindicados","Mutuoshipotecarios","AccionesdeS.A.","Fondosmutuos","FondoinversiÃ³n","InversiÃ³nexterior","Cuentascorrientes","Avancetened.depÃ³lizas","Inversionesinmobiliarias","PrÃ©stamos","Otros(3)","TOTAL"]
["Razón social","TipodecompaÃ±Ã­a","InstrumentosdelEstado","DepÃ³sitosaplazo","Bonosbancarios","Letrashipotecarias","Bonosydebentures","CrÃ©ditossindicados","Mutuoshipotecarios","AccionesdeS.A.","Fondosmutuos","FondoinversiÃ³n","InversiÃ³nexterior","Cuentascorrientes","Avancetened.depÃ³lizas","Inversionesinmobiliarias","PrÃ©stamos","Otros(3)","TOTAL"]
["4 Life Seguros","4LIFE",23934177,1317458,78791123,540126,308129458,1690963,71463861,1753758,3845595,86577148,244543136,712703,null,152724937,null,8852412,984876855]
["Alemana Seguros","ALEMANA",3481234,null,4579709,null,3037039,{"$nulls":3},212878,null,null,176284,{"$nulls":3},174507,11661651]
["BCI Seguros Vida","BCI",1868609,3972680,84593368,46862,73753205,null,3380269,325023,18603788,18057356,13395329,7283618,null,34055012,null,470616,259805735]
["BICE Vida","BICE",18584926,62792478,648811181,3631726,2253487379,86489841,960768095,2253278,27938603,120907502,827779023,4317532,14309443,978526409,65399471,162300922,6238297809]
["BNP Paribas Cardif","BNP",109893646,3109061,99042291,2598,64754765,null,132161,null,4059444,null,null,8433357,null,2932750,null,1964126,294324199]
["Bupa","BUPA VIDA",6132301,1545200,4019389,{"$nulls":5},514373,null,null,107506,{"$nulls":3},1177,12319946]
["Cámara","CAMARA",1980367,null,28167755,null,4324633,{"$nulls":3},3844554,null,null,541722,null,5998142,null,688044,45545217]
["CF Seguros de Vida","CF",20027097,null,11549673,{"$nulls":5},10901,null,null,435098,{"$nulls":3},1000,32023769]
["Chubb Vida","CHUBB VIDA",89402227,null,63482412,null,54528090,{"$nulls":6},8934071,{"$nulls":3},695912,217042712]
["CLC","CLC",2314180,2890,7110419,27084,3270479,{"$nulls":6},625923,{"$nulls":3},13938,13364913]
["CN Life","CN LIFE",1306577,1140256,40406943,157999,411456600,25028364,60457833,8761664,25719506,35342642,199258770,2365637,null,67188800,null,30256487,908848078]
["Colmena Seguros","COLMENA",4468977,1419,6611713,21869,3772776,{"$nulls":6},361372,{"$nulls":3},21035,15259161]
["Confuturo","CONFUTURO",67860131,618530028,1120330039,34675580,1776929610,200605363,369876397,39894749,69760111,224443506,1986616971,15234319,634718,1800994771,57325619,137493516,8521205428]
{"$rows_left_out":29}