{"text_format":"3","workbook":"xlsx","n_sheets":2,"sheets":["Inversiones","base"],"not_rendered":{"charts":1,"images":1,"defined_names":2},"read":"whole","date_system":"1900"}

{"sheet":"Inversiones","index":0,"n_rows":65,"n_cols":37,"rows_kept":65}
[]
[]
[{"$nulls":3},"Reporte de Inversiones - Compañías de Seguros Generales"]
[{"$nulls":3},"Datos a Diciembre de 2023"]
[]
[null,null,"Seleccionar Moneda"]
[{"$nulls":8},"Cifras en M$",1]
[null,null,"Cifras en UF",{"$nulls":4},{"$f":"Moneda","v":"Cifras en UF"},"Cifras en UF",{"$f":"1000/K8","v":{"v":0.027181772121069786,"d":"0.0271818"}},{"v":36789.36,"d":"36,789.36"}]
[{"$nulls":7},{"$f":"VLOOKUP(H8,I7:J9,2,0)","v":0.027181772121069786},"Cifras en US$",{"$f":"1000/K9","v":1.130467222102895},884.59]
[null,null,"Utilizar fila para revisar","ASSURANT Chile","AVLA crédito","BCI Seguros","BNP Paribas Cardiff","CESCE CHILE","CHUBB GENERALES","COFACE CHILE","CONSORCIO NACIONAL","CONTEMPORA","CONTINENTAL GENERALES","CREDITO CONTINENTAL","EVEREST","FID CHILE","HDI SEGUROS","KONSEGUR","LIBERTY SEGUROS","MUT DE CARABINEROS","MAPFRE","METLIFE GENERALES","ORION seguros","ORSAN","PORVENIR","REALE CHILE","RENTA NACIONAL","SOLUNION","SOUTHBRIDGE","STARR international","SURAMERICANA","UNNIO","ZENIT seguros","ZURICH CHILE","ZURICH SANTANDER"]
[null,null,"No borrar fila","ASSURANT Chile","AVLA crédito","BCI Seguros","BNP Paribas Cardiff","CESCE CHILE","CHUBB GENERALES","COFACE CHILE","CONSORCIO NACIONAL","CONTEMPORA","CONTINENTAL GENERALES","CREDITO CONTINENTAL","EVEREST","FID CHILE","HDI SEGUROS","KONSEGUR","LIBERTY SEGUROS","MUT DE CARABINEROS","MAPFRE","METLIFE GENERALES","ORION seguros","ORSAN","PORVENIR","REALE CHILE","RENTA NACIONAL","SOLUNION","SOUTHBRIDGE","STARR international","SURAMERICANA","UNNIO","ZENIT seguros","ZURICH CHILE","ZURICH SANTANDER"]
[null,null,"TIPO DE INSTRUMENTO","Assurant Chile","AVLA Crédito","BCI Seguros","BNP Paribas Cardif","Cesce Chile","Chubb Generales","Coface Chile","Consorcio Nacional","Contempora","Continental Crédito","Continental Generales","Everest Generales","FID Chile","HDI Seguros","Konsegur","Liberty Seguros","M. de Carabineros","Mapfre","MetLife Generales","Orion Seguros","Orsan Crédito","Porvenir","Reale Chile","Renta Nacional","Solunión Chile","Southbridge","Starr International","Suramericana","Unnio","Zenit Seguros","Zurich Chile","Zurich Santander"]
[3,"InstrumentosdelEstado","Instrumentos del Estado",{"$f":"VLOOKUP(D$11,base!$A$8:$R$46,$A13,FALSE)","v":2009088},{"$f":"VLOOKUP(E$11,base!$A$8:$R$46,$A13,FALSE)","v":3608677},{"$f":"VLOOKUP(F$11,base!$A$8:$R$46,$A13,FALSE)","v":15729621},{"$f":"VLOOKUP(G$11,base!$A$8:$R$46,$A13,FALSE)","v":59047460},{"$f":"VLOOKUP(H$11,base!$A$8:$R$46,$A13,FALSE)","v":1136496},{"$f":"VLOOKUP(I$11,base!$A$8:$R$46,$A13,FALSE)","v":64909526},{"$f":"VLOOKUP(J$11,base!$A$8:$R$46,$A13,FALSE)","v":17780023},{"$f":"VLOOKUP(K$11,base!$A$8:$R$46,$A13,FALSE)","v":0},{"$f":"VLOOKUP(L$11,base!$A$8:$R$46,$A13,FALSE)","v":728131},{"$f":"VLOOKUP(M$11,base!$A$8:$R$46,$A13,FALSE)","v":0},{"$f":"VLOOKUP(N$11,base!$A$8:$R$46,$A13,FALSE)","v":0},{"$f":"VLOOKUP(O$11,base!$A$8:$R$46,$A13,FALSE)","v":0},{"$f":"VLOOKUP(P$11,base!$A$8:$R$46,$A13,FALSE)","v":7927153},{"$f":"VLOOKUP(Q$11,base!$A$8:$R$46,$A13,FALSE)","v":43609614},{"$f":"VLOOKUP(R$11,base!$A$8:$R$46,$A13,FALSE)","v":0},{"$f":"VLOOKUP(S$11,base!$A$8:$R$46,$A13,FALSE)","v":61159563},{"$f":"VLOOKUP(T$11,base!$A$8:$R$46,$A13,FALSE)","v":4322358},{"$f":"VLOOKUP(U$11,base!$A$8:$R$46,$A13,FALSE)","v":217375},{"$f":"VLOOKUP(V$11,base!$A$8:$R$46,$A13,FALSE)","v":0},{"$f":"VLOOKUP(W$11,base!$A$8:$R$46,$A13,FALSE)","v":1656306},{"$f":"VLOOKUP(X$11,base!$A$8:$R$46,$A13,FALSE)","v":4453663},{"$f":"VLOOKUP(Y$11,base!$A$8:$R$46,$A13,FALSE)","v":3889309},{"$f":"VLOOKUP(Z$11,base!$A$8:$R$46,$A13,FALSE)","v":8060738},{"$f":"VLOOKUP(AA$11,base!$A$8:$R$46,$A13,FALSE)","v":5400999},{"$f":"VLOOKUP(AB$11,base!$A$8:$R$46,$A13,FALSE)","v":6915977},{"$f":"VLOOKUP(AC$11,base!$A$8:$R$46,$A13,FALSE)","v":26859019},{"$f":"VLOOKUP(AD$11,base!$A$8:$R$46,$A13,FALSE)","v":0},{"$f":"VLOOKUP(AE$11,base!$A$8:$R$46,$A13,FALSE)","v":33387047},{"$f":"VLOOKUP(AF$11,base!$A$8:$R$46,$A13,FALSE)","v":10615226},{"$f":"VLOOKUP(AG$11,base!$A$8:$R$46,$A13,FALSE)","v":569204},{"$f":"VLOOKUP(AH$11,base!$A$8:$R$46,$A13,FALSE)","v":15398171},{"$f":"VLOOKUP(AI$11,base!$A$8:$R$46,$A13,FALSE)","v":21513718}]
[4,"DepÃ³sitosaplazo","Depósitos a Plazo",{"$f":"VLOOKUP(D$11,base!$A$8:$R$46,$A14,FALSE)","v":5946918},{"$f":"VLOOKUP(E$11,base!$A$8:$R$46,$A14,FALSE)","v":375977},{"$f":"VLOOKUP(F$11,base!$A$8:$R$46,$A14,FALSE)","v":26351092},{"$f":"VLOOKUP(G$11,base!$A$8:$R$46,$A14,FALSE)","v":6053867},{"$f":"VLOOKUP(H$11,base!$A$8:$R$46,$A14,FALSE)","v":0},{"$f":"VLOOKUP(I$11,base!$A$8:$R$46,$A14,FALSE)","v":25761075},{"$f":"VLOOKUP(J$11,base!$A$8:$R$46,$A14,FALSE)","v":0},{"$f":"VLOOKUP(K$11,base!$A$8:$R$46,$A14,FALSE)","v":2847612},{"$f":"VLOOKUP(L$11,base!$A$8:$R$46,$A14,FALSE)","v":0},{"$f":"VLOOKUP(M$11,base!$A$8:$R$46,$A14,FALSE)","v":22522116},{"$f":"VLOOKUP(N$11,base!$A$8:$R$46,$A14,FALSE)","v":9643794},{"$f":"VLOOKUP(O$11,base!$A$8:$R$46,$A14,FALSE)","v":0},{"$f":"VLOOKUP(P$11,base!$A$8:$R$46,$A14,FALSE)","v":1040749},{"$f":"VLOOKUP(Q$11,base!$A$8:$R$46,$A14,FALSE)","v":3303685},{"$f":"VLOOKUP(R$11,base!$A$8:$R$46,$A14,FALSE)","v":0},{"$f":"VLOOKUP(S$11,base!$A$8:$R$46,$A14,FALSE)","v":14828856},{"$f":"VLOOKUP(T$11,base!$A$8:$R$46,$A14,FALSE)","v":13161292},{"$f":"VLOOKUP(U$11,base!$A$8:$R$46,$A14,FALSE)","v":1614051},{"$f":"VLOOKUP(V$11,base!$A$8:$R$46,$A14,FALSE)","v":0},{"$f":"VLOOKUP(W$11,base!$A$8:$R$46,$A14,FALSE)","v":1790548},{"$f":"VLOOKUP(X$11,base!$A$8:$R$46,$A14,FALSE)","v":56786},{"$f":"VLOOKUP(Y$11,base!$A$8:$R$46,$A14,FALSE)","v":2035777},{"$f":"VLOOKUP(Z$11,base!$A$8:$R$46,$A14,FALSE)","v":2001793},{"$f":"VLOOKUP(AA$11,base!$A$8:$R$46,$A14,FALSE)","v":547514},{"$f":"VLOOKUP(AB$11,base!$A$8:$R$46,$A14,FALSE)","v":0},{"$f":"VLOOKUP(AC$11,base!$A$8:$R$46,$A14,FALSE)","v":0},{"$f":"VLOOKUP(AD$11,base!$A$8:$R$46,$A14,FALSE)","v":0},{"$f":"VLOOKUP(AE$11,base!$A$8:$R$46,$A14,FALSE)","v":0},{"$f":"VLOOKUP(AF$11,base!$A$8:$R$46,$A14,FALSE)","v":0},{"$f":"VLOOKUP(AG$11,base!$A$8:$R$46,$A14,FALSE)","v":4879679},{"$f":"VLOOKUP(AH$11,base!$A$8:$R$46,$A14,FALSE)","v":2004898},{"$f":"VLOOKUP(AI$11,base!$A$8:$R$46,$A14,FALSE)","v":0}]
[5,"Bonosbancarios","Bonos Bancarios",{"$f":"VLOOKUP(D$11,base!$A$8:$R$46,$A15,FALSE)","v":0},{"$f":"VLOOKUP(E$11,base!$A$8:$R$46,$A15,FALSE)","v":1714523},{"$f":"VLOOKUP(F$11,base!$A$8:$R$46,$A15,FALSE)","v":177567785},{"$f":"VLOOKUP(G$11,base!$A$8:$R$46,$A15,FALSE)","v":63325957},{"$f":"VLOOKUP(H$11,base!$A$8:$R$46,$A15,FALSE)","v":676079},{"$f":"VLOOKUP(I$11,base!$A$8:$R$46,$A15,FALSE)","v":63780443},{"$f":"VLOOKUP(J$11,base!$A$8:$R$46,$A15,FALSE)","v":2401785},{"$f":"VLOOKUP(K$11,base!$A$8:$R$46,$A15,FALSE)","v":15126258},{"$f":"VLOOKUP(L$11,base!$A$8:$R$46,$A15,FALSE)","v":2252869},{"$f":"VLOOKUP(M$11,base!$A$8:$R$46,$A15,FALSE)","v":0},{"$f":"VLOOKUP(N$11,base!$A$8:$R$46,$A15,FALSE)","v":0},{"$f":"VLOOKUP(O$11,base!$A$8:$R$46,$A15,FALSE)","v":0},{"$f":"VLOOKUP(P$11,base!$A$8:$R$46,$A15,FALSE)","v":6632005},{"$f":"VLOOKUP(Q$11,base!$A$8:$R$46,$A15,FALSE)","v":152712019},{"$f":"VLOOKUP(R$11,base!$A$8:$R$46,$A15,FALSE)","v":0},{"$f":"VLOOKUP(S$11,base!$A$8:$R$46,$A15,FALSE)","v":111853403},{"$f":"VLOOKUP(T$11,base!$A$8:$R$46,$A15,FALSE)","v":0},{"$f":"VLOOKUP(U$11,base!$A$8:$R$46,$A15,FALSE)","v":46567715},{"$f":"VLOOKUP(V$11,base!$A$8:$R$46,$A15,FALSE)","v":1001645},{"$f":"VLOOKUP(W$11,base!$A$8:$R$46,$A15,FALSE)","v":12574616},{"$f":"VLOOKUP(X$11,base!$A$8:$R$46,$A15,FALSE)","v":9103196},{"$f":"VLOOKUP(Y$11,base!$A$8:$R$46,$A15,FALSE)","v":3028818},{"$f":"VLOOKUP(Z$11,base!$A$8:$R$46,$A15,FALSE)","v":3571829},{"$f":"VLOOKUP(AA$11,base!$A$8:$R$46,$A15,FALSE)","v":10684393},{"$f":"VLOOKUP(AB$11,base!$A$8:$R$46,$A15,FALSE)","v":1300259},{"$f":"VLOOKUP(AC$11,base!$A$8:$R$46,$A15,FALSE)","v":16848824},{"$f":"VLOOKUP(AD$11,base!$A$8:$R$46,$A15,FALSE)","v":0},{"$f":"VLOOKUP(AE$11,base!$A$8:$R$46,$A15,FALSE)","v":112401471},{"$f":"VLOOKUP(AF$11,base!$A$8:$R$46,$A15,FALSE)","v":0},{"$f":"VLOOKUP(AG$11,base!$A$8:$R$46,$A15,FALSE)","v":15390980},{"$f":"VLOOKUP(AH$11,base!$A$8:$R$46,$A15,FALSE)","v":14563600},{"$f":"VLOOKUP(AI$11,base!$A$8:$R$46,$A15,FALSE)","v":20341351}]
[6,"Letrashipotecarias","Letras Hipotecarias",{"$f":"VLOOKUP(D$11,base!$A$8:$R$46,$A16,FALSE)","v":0},{"$f":"VLOOKUP(E$11,base!$A$8:$R$46,$A16,FALSE)","v":0},{"$f":"VLOOKUP(F$11,base!$A$8:$R$46,$A16,FALSE)","v":0},{"$f":"VLOOKUP(G$11,base!$A$8:$R$46,$A16,FALSE)","v":4424},{"$f":"VLOOKUP(H$11,base!$A$8:$R$46,$A16,FALSE)","v":52476},{"$f":"VLOOKUP(I$11,base!$A$8:$R$46,$A16,FALSE)","v":0},{"$f":"VLOOKUP(J$11,base!$A$8:$R$46,$A16,FALSE)","v":0},{"$f":"VLOOKUP(K$11,base!$A$8:$R$46,$A16,FALSE)","v":756002},{"$f":"VLOOKUP(L$11,base!$A$8:$R$46,$A16,FALSE)","v":0},{"$f":"VLOOKUP(M$11,base!$A$8:$R$46,$A16,FALSE)","v":0},{"$f":"VLOOKUP(N$11,base!$A$8:$R$46,$A16,FALSE)","v":0},{"$f":"VLOOKUP(O$11,base!$A$8:$R$46,$A16,FALSE)","v":0},{"$f":"VLOOKUP(P$11,base!$A$8:$R$46,$A16,FALSE)","v":0},{"$f":"VLOOKUP(Q$11,base!$A$8:$R$46,$A16,FALSE)","v":95093},{"$f":"VLOOKUP(R$11,base!$A$8:$R$46,$A16,FALSE)","v":0},{"$f":"VLOOKUP(S$11,base!$A$8:$R$46,$A16,FALSE)","v":149098},{"$f":"VLOOKUP(T$11,base!$A$8:$R$46,$A16,FALSE)","v":0},{"$f":"VLOOKUP(U$11,base!$A$8:$R$46,$A16,FALSE)","v":0},{"$f":"VLOOKUP(V$11,base!$A$8:$R$46,$A16,FALSE)","v":0},{"$f":"VLOOKUP(W$11,base!$A$8:$R$46,$A16,FALSE)","v":0},{"$f":"VLOOKUP(X$11,base!$A$8:$R$46,$A16,FALSE)","v":0},{"$f":"VLOOKUP(Y$11,base!$A$8:$R$46,$A16,FALSE)","v":0},{"$f":"VLOOKUP(Z$11,base!$A$8:$R$46,$A16,FALSE)","v":0},{"$f":"VLOOKUP(AA$11,base!$A$8:$R$46,$A16,FALSE)","v":28072},{"$f":"VLOOKUP(AB$11,base!$A$8:$R$46,$A16,FALSE)","v":0},{"$f":"VLOOKUP(AC$11,base!$A$8:$R$46,$A16,FALSE)","v":0},{"$f":"VLOOKUP(AD$11,base!$A$8:$R$46,$A16,FALSE)","v":0},{"$f":"VLOOKUP(AE$11,base!$A$8:$R$46,$A16,FALSE)","v":0},{"$f":"VLOOKUP(AF$11,base!$A$8:$R$46,$A16,FALSE)","v":0},{"$f":"VLOOKUP(AG$11,base!$A$8:$R$46,$A16,FALSE)","v":0},{"$f":"VLOOKUP(AH$11,base!$A$8:$R$46,$A16,FALSE)","v":0},{"$f":"VLOOKUP(AI$11,base!$A$8:$R$46,$A16,FALSE)","v":106831}]
[7,"Bonosydebentures","Bonos y Debentures",{"$f":"VLOOKUP(D$11,base!$A$8:$R$46,$A17,FALSE)","v":0},{"$f":"VLOOKUP(E$11,base!$A$8:$R$46,$A17,FALSE)","v":1439025},{"$f":"VLOOKUP(F$11,base!$A$8:$R$46,$A17,FALSE)","v":18454075},{"$f":"VLOOKUP(G$11,base!$A$8:$R$46,$A17,FALSE)","v":46391105},{"$f":"VLOOKUP(H$11,base!$A$8:$R$46,$A17,FALSE)","v":663245},{"$f":"VLOOKUP(I$11,base!$A$8:$R$46,$A17,FALSE)","v":38797608},{"$f":"VLOOKUP(J$11,base!$A$8:$R$46,$A17,FALSE)","v":527801},{"$f":"VLOOKUP(K$11,base!$A$8:$R$46,$A17,FALSE)","v":23839435},{"$f":"VLOOKUP(L$11,base!$A$8:$R$46,$A17,FALSE)","v":1227798},{"$f":"VLOOKUP(M$11,base!$A$8:$R$46,$A17,FALSE)","v":0},{"$f":"VLOOKUP(N$11,base!$A$8:$R$46,$A17,FALSE)","v":0},{"$f":"VLOOKUP(O$11,base!$A$8:$R$46,$A17,FALSE)","v":0},{"$f":"VLOOKUP(P$11,base!$A$8:$R$46,$A17,FALSE)","v":2736819},{"$f":"VLOOKUP(Q$11,base!$A$8:$R$46,$A17,FALSE)","v":56435419},{"$f":"VLOOKUP(R$11,base!$A$8:$R$46,$A17,FALSE)","v":0},{"$f":"VLOOKUP(S$11,base!$A$8:$R$46,$A17,FALSE)","v":11203560},{"$f":"VLOOKUP(T$11,base!$A$8:$R$46,$A17,FALSE)","v":0},{"$f":"VLOOKUP(U$11,base!$A$8:$R$46,$A17,FALSE)","v":16524469},{"$f":"VLOOKUP(V$11,base!$A$8:$R$46,$A17,FALSE)","v":663018},{"$f":"VLOOKUP(W$11,base!$A$8:$R$46,$A17,FALSE)","v":6488407},{"$f":"VLOOKUP(X$11,base!$A$8:$R$46,$A17,FALSE)","v":1484061},{"$f":"VLOOKUP(Y$11,base!$A$8:$R$46,$A17,FALSE)","v":2905075},{"$f":"VLOOKUP(Z$11,base!$A$8:$R$46,$A17,FALSE)","v":0},{"$f":"VLOOKUP(AA$11,base!$A$8:$R$46,$A17,FALSE)","v":12613122},{"$f":"VLOOKUP(AB$11,base!$A$8:$R$46,$A17,FALSE)","v":0},{"$f":"VLOOKUP(AC$11,base!$A$8:$R$46,$A17,FALSE)","v":31848201},{"$f":"VLOOKUP(AD$11,base!$A$8:$R$46,$A17,FALSE)","v":0},{"$f":"VLOOKUP(AE$11,base!$A$8:$R$46,$A17,FALSE)","v":28675822},{"$f":"VLOOKUP(AF$11,base!$A$8:$R$46,$A17,FALSE)","v":0},{"$f":"VLOOKUP(AG$11,base!$A$8:$R$46,$A17,FALSE)","v":617313},{"$f":"VLOOKUP(AH$11,base!$A$8:$R$46,$A17,FALSE)","v":42160806},{"$f":"VLOOKUP(AI$11,base!$A$8:$R$46,$A17,FALSE)","v":55022315}]
[8,"CrÃ©ditossindicados","Créditos Sindicados",{"$f":"VLOOKUP(D$11,base!$A$8:$R$46,$A18,FALSE)","v":0},{"$f":"VLOOKUP(E$11,base!$A$8:$R$46,$A18,FALSE)","v":0},{"$f":"VLOOKUP(F$11,base!$A$8:$R$46,$A18,FALSE)","v":0},{"$f":"VLOOKUP(G$11,base!$A$8:$R$46,$A18,FALSE)","v":0},{"$f":"VLOOKUP(H$11,base!$A$8:$R$46,$A18,FALSE)","v":0},{"$f":"VLOOKUP(I$11,base!$A$8:$R$46,$A18,FALSE)","v":0},{"$f":"VLOOKUP(J$11,base!$A$8:$R$46,$A18,FALSE)","v":0},{"$f":"VLOOKUP(K$11,base!$A$8:$R$46,$A18,FALSE)","v":0},{"$f":"VLOOKUP(L$11,base!$A$8:$R$46,$A18,FALSE)","v":0},{"$f":"VLOOKUP(M$11,base!$A$8:$R$46,$A18,FALSE)","v":0},{"$f":"VLOOKUP(N$11,base!$A$8:$R$46,$A18,FALSE)","v":0},{"$f":"VLOOKUP(O$11,base!$A$8:$R$46,$A18,FALSE)","v":0},{"$f":"VLOOKUP(P$11,base!$A$8:$R$46,$A18,FALSE)","v":0},{"$f":"VLOOKUP(Q$11,base!$A$8:$R$46,$A18,FALSE)","v":0},{"$f":"VLOOKUP(R$11,base!$A$8:$R$46,$A18,FALSE)","v":0},{"$f":"VLOOKUP(S$11,base!$A$8:$R$46,$A18,FALSE)","v":0},{"$f":"VLOOKUP(T$11,base!$A$8:$R$46,$A18,FALSE)","v":0},{"$f":"VLOOKUP(U$11,base!$A$8:$R$46,$A18,FALSE)","v":0},{"$f":"VLOOKUP(V$11,base!$A$8:$R$46,$A18,FALSE)","v":0},{"$f":"VLOOKUP(W$11,base!$A$8:$R$46,$A18,FALSE)","v":0},{"$f":"VLOOKUP(X$11,base!$A$8:$R$46,$A18,FALSE)","v":0},{"$f":"VLOOKUP(Y$11,base!$A$8:$R$46,$A18,FALSE)","v":0},{"$f":"VLOOKUP(Z$11,base!$A$8:$R$46,$A18,FALSE)","v":0},{"$f":"VLOOKUP(AA$11,base!$A$8:$R$46,$A18,FALSE)","v":0},{"$f":"VLOOKUP(AB$11,base!$A$8:$R$46,$A18,FALSE)","v":0},{"$f":"VLOOKUP(AC$11,base!$A$8:$R$46,$A18,FALSE)","v":0},{"$f":"VLOOKUP(AD$11,base!$A$8:$R$46,$A18,FALSE)","v":0},{"$f":"VLOOKUP(AE$11,base!$A$8:$R$46,$A18,FALSE)","v":0},{"$f":"VLOOKUP(AF$11,base!$A$8:$R$46,$A18,FALSE)","v":0},{"$f":"VLOOKUP(AG$11,base!$A$8:$R$46,$A18,FALSE)","v":0},{"$f":"VLOOKUP(AH$11,base!$A$8:$R$46,$A18,FALSE)","v":0},{"$f":"VLOOKUP(AI$11,base!$A$8:$R$46,$A18,FALSE)","v":0}]
[9,"Mutuoshipotecarios","Mutuos Hipotecarios",{"$f":"VLOOKUP(D$11,base!$A$8:$R$46,$A19,FALSE)","v":0},{"$f":"VLOOKUP(E$11,base!$A$8:$R$46,$A19,FALSE)","v":3446574},{"$f":"VLOOKUP(F$11,base!$A$8:$R$46,$A19,FALSE)","v":0},{"$f":"VLOOKUP(G$11,base!$A$8:$R$46,$A19,FALSE)","v":71547},{"$f":"VLOOKUP(H$11,base!$A$8:$R$46,$A19,FALSE)","v":0},{"$f":"VLOOKUP(I$11,base!$A$8:$R$46,$A19,FALSE)","v":0},{"$f":"VLOOKUP(J$11,base!$A$8:$R$46,$A19,FALSE)","v":0},{"$f":"VLOOKUP(K$11,base!$A$8:$R$46,$A19,FALSE)","v":0},{"$f":"VLOOKUP(L$11,base!$A$8:$R$46,$A19,FALSE)","v":0},{"$f":"VLOOKUP(M$11,base!$A$8:$R$46,$A19,FALSE)","v":0},{"$f":"VLOOKUP(N$11,base!$A$8:$R$46,$A19,FALSE)","v":0},{"$f":"VLOOKUP(O$11,base!$A$8:$R$46,$A19,FALSE)","v":0},{"$f":"VLOOKUP(P$11,base!$A$8:$R$46,$A19,FALSE)","v":0},{"$f":"VLOOKUP(Q$11,base!$A$8:$R$46,$A19,FALSE)","v":0},{"$f":"VLOOKUP(R$11,base!$A$8:$R$46,$A19,FALSE)","v":0},{"$f":"VLOOKUP(S$11,base!$A$8:$R$46,$A19,FALSE)","v":0},{"$f":"VLOOKUP(T$11,base!$A$8:$R$46,$A19,FALSE)","v":0},{"$f":"VLOOKUP(U$11,base!$A$8:$R$46,$A19,FALSE)","v":0},{"$f":"VLOOKUP(V$11,base!$A$8:$R$46,$A19,FALSE)","v":0},{"$f":"VLOOKUP(W$11,base!$A$8:$R$46,$A19,FALSE)","v":0},{"$f":"VLOOKUP(X$11,base!$A$8:$R$46,$A19,FALSE)","v":0},{"$f":"VLOOKUP(Y$11,base!$A$8:$R$46,$A19,FALSE)","v":0},{"$f":"VLOOKUP(Z$11,base!$A$8:$R$46,$A19,FALSE)","v":0},{"$f":"VLOOKUP(AA$11,base!$A$8:$R$46,$A19,FALSE)","v":0},{"$f":"VLOOKUP(AB$11,base!$A$8:$R$46,$A19,FALSE)","v":0},{"$f":"VLOOKUP(AC$11,base!$A$8:$R$46,$A19,FALSE)","v":962809},{"$f":"VLOOKUP(AD$11,base!$A$8:$R$46,$A19,FALSE)","v":0},{"$f":"VLOOKUP(AE$11,base!$A$8:$R$46,$A19,FALSE)","v":0},{"$f":"VLOOKUP(AF$11,base!$A$8:$R$46,$A19,FALSE)","v":0},{"$f":"VLOOKUP(AG$11,base!$A$8:$R$46,$A19,FALSE)","v":0},{"$f":"VLOOKUP(AH$11,base!$A$8:$R$46,$A19,FALSE)","v":5913685},{"$f":"VLOOKUP(AI$11,base!$A$8:$R$46,$A19,FALSE)","v":10004783}]
[10,"AccionesdeS.A.","Acciones de S.A.",{"$f":"VLOOKUP(D$11,base!$A$8:$R$46,$A20,FALSE)","v":0},{"$f":"VLOOKUP(E$11,base!$A$8:$R$46,$A20,FALSE)","v":0},{"$f":"VLOOKUP(F$11,base!$A$8:$R$46,$A20,FALSE)","v":325023},{"$f":"VLOOKUP(G$11,base!$A$8:$R$46,$A20,FALSE)","v":0},{"$f":"VLOOKUP(H$11,base!$A$8:$R$46,$A20,FALSE)","v":0},{"$f":"VLOOKUP(I$11,base!$A$8:$R$46,$A20,FALSE)","v":0},{"$f":"VLOOKUP(J$11,base!$A$8:$R$46,$A20,FALSE)","v":0},{"$f":"VLOOKUP(K$11,base!$A$8:$R$46,$A20,FALSE)","v":0},{"$f":"VLOOKUP(L$11,base!$A$8:$R$46,$A20,FALSE)","v":0},{"$f":"VLOOKUP(M$11,base!$A$8:$R$46,$A20,FALSE)","v":0},{"$f":"VLOOKUP(N$11,base!$A$8:$R$46,$A20,FALSE)","v":465732},{"$f":"VLOOKUP(O$11,base!$A$8:$R$46,$A20,FALSE)","v":0},{"$f":"VLOOKUP(P$11,base!$A$8:$R$46,$A20,FALSE)","v":0},{"$f":"VLOOKUP(Q$11,base!$A$8:$R$46,$A20,FALSE)","v":0},{"$f":"VLOOKUP(R$11,base!$A$8:$R$46,$A20,FALSE)","v":0},{"$f":"VLOOKUP(S$11,base!$A$8:$R$46,$A20,FALSE)","v":0},{"$f":"VLOOKUP(T$11,base!$A$8:$R$46,$A20,FALSE)","v":0},{"$f":"VLOOKUP(U$11,base!$A$8:$R$46,$A20,FALSE)","v":10569},{"$f":"VLOOKUP(V$11,base!$A$8:$R$46,$A20,FALSE)","v":0},{"$f":"VLOOKUP(W$11,base!$A$8:$R$46,$A20,FALSE)","v":0},{"$f":"VLOOKUP(X$11,base!$A$8:$R$46,$A20,FALSE)","v":585810},{"$f":"VLOOKUP(Y$11,base!$A$8:$R$46,$A20,FALSE)","v":0},{"$f":"VLOOKUP(Z$11,base!$A$8:$R$46,$A20,FALSE)","v":0},{"$f":"VLOOKUP(AA$11,base!$A$8:$R$46,$A20,FALSE)","v":0},{"$f":"VLOOKUP(AB$11,base!$A$8:$R$46,$A20,FALSE)","v":0},{"$f":"VLOOKUP(AC$11,base!$A$8:$R$46,$A20,FALSE)","v":22448568},{"$f":"VLOOKUP(AD$11,base!$A$8:$R$46,$A20,FALSE)","v":0},{"$f":"VLOOKUP(AE$11,base!$A$8:$R$46,$A20,FALSE)","v":0},{"$f":"VLOOKUP(AF$11,base!$A$8:$R$46,$A20,FALSE)","v":0},{"$f":"VLOOKUP(AG$11,base!$A$8:$R$46,$A20,FALSE)","v":0},{"$f":"VLOOKUP(AH$11,base!$A$8:$R$46,$A20,FALSE)","v":297},{"$f":"VLOOKUP(AI$11,base!$A$8:$R$46,$A20,FALSE)","v":0}]
{"$rows_left_out":46}
{"sheet":"base","index":1,"n_rows":49,"n_cols":18,"rows_kept":49,"hidden":true}
["COMISIÓN PARA EL MERCADO FINANCIERO"]
["Tipo de compañía: CIAS. DE SEGUROS GENERALES, CIAS. REASEGURADORAS GENERALES  Y  CIAS. DE SEGUROS CRéDITO"]
["Fecha: DICIEMBRE 2022"]
[]
[]
["Mantener esta columna siempre","TipodecompaÃ±Ã­a","InstrumentosdelEstado","DepÃ³sitosaplazo","Bonosbancarios","Letrashipotecarias","Bonosydebentures","CrÃ©ditossindicados","Mutuoshipotecarios","AccionesdeS.A.","Fondosmutuos","FondoinversiÃ³n","InversiÃ³nexterior","Cuentascorrientes","Inversionesinmobiliarias","PrÃ©stamos","Otros(3)","TOTAL"]
["Razón social","TipodecompaÃ±Ã­a","InstrumentosdelEstado","DepÃ³sitosaplazo","Bonosbancarios","Letrashipotecarias","Bonosydebentures","CrÃ©ditossindicados","Mutuoshipotecarios","AccionesdeS.A.","Fondosmutuos","FondoinversiÃ³n","InversiÃ³nexterior","Cuentascorrientes","Inversionesinmobiliarias","PrÃ©stamos","Otros(3)","TOTAL"]
["ASSURANT Chile","ASSURANT",2009088,5946918,{"$nulls":9},2994130,{"$nulls":3},10950136]
["BCI Seguros","BCI",15729621,26351092,177567785,null,18454075,null,null,325023,10342575,29265700,46223396,17074000,30617405,null,4396963,376347635]
["BNP Paribas Cardiff","BNP",59047460,6053867,63325957,4424,46391105,null,71547,null,6265126,null,null,1642345,8274136,null,1387753,192463720]
["CHUBB GENERALES","CHUBB GENERALES",64909526,25761075,63780443,null,38797608,{"$nulls":6},20717440,1606320,null,1612805,217185217]
["CONSORCIO NACIONAL","CONSORCIO NACIONAL",null,2847612,15126258,756002,23839435,{"$nulls":3},1350998,null,2345686,2694634,4435340,null,109419,53505384]
["CONTEMPORA","CONTEMPORA",728131,null,2252869,null,1227798,{"$nulls":6},844397,null,null,14096,5067291]
["CONTINENTAL GENERALES","CONTINENTAL",null,22522116,{"$nulls":9},7130829,1076677,null,23469,30753091]
["EVEREST","EVEREST",{"$nulls":11},47527213,null,null,954108,48481321]
["FID CHILE","FID",7927153,1040749,6632005,null,2736819,{"$nulls":6},4148574,null,null,346210,22831510]
["HDI SEGUROS","HDI",43609614,3303685,152712019,95093,56435419,{"$nulls":6},39719977,7149879,null,1686536,304712222]
["LIBERTY SEGUROS","LIBERTY",61159563,14828856,111853403,149098,11203560,{"$nulls":6},34665202,8253800,null,805626,242919108]
["MAPFRE","MAPFRE",217375,1614051,46567715,null,16524469,null,null,10569,10178936,7678423,null,21431204,1294600,null,883882,106401224]
["METLIFE GENERALES","METLIFE GENERALES",null,null,1001645,null,663018,{"$nulls":3},1013144,null,null,7089008,{"$nulls":3},9766815]
{"$rows_left_out":29}